BDBM50300428 CHEMBL574179::cis-2,5-Di(2-benzyl)-pyrrolidine
SMILES C([C@H]1CC[C@@H](Cc2ccccc2)N1)c1ccccc1
InChI Key InChIKey=JWFLOEKZECISRU-HDICACEKSA-N
Data  2 KI
  Tab Delimited (TSV)   2D SDfile   Computed 3D by Vconf -m prep SDfile
Find this compound or compounds like it in BindingDB:
Activity Spreadsheet -- Enzyme Inhibition Constant Data from BindingDB
Found 2 hits for monomerid = 50300428
TargetSynaptic vesicular amine transporter(Rattus norvegicus (Rat))
University Of Kentucky
Curated by ChEMBL
LigandPNGBDBM50300428(CHEMBL574179 | cis-2,5-Di(2-benzyl)-pyrrolidine)
Affinity DataKi:  9.30nM. Assay description: Inhibition of [3H]dopamine uptake at VMAT2 in rat brain synaptic vesicle by liquid scintillation spectroscopy
In DepthDetails ArticlePubMed
TargetSynaptic vesicular amine transporter(Rattus norvegicus (Rat))
University Of Kentucky
Curated by ChEMBL
LigandPNGBDBM50300428(CHEMBL574179 | cis-2,5-Di(2-benzyl)-pyrrolidine)
Affinity DataKi:  1.64E+3nM. Assay description: Displacement of [3H]DTBZ from VMAT2 dihydrotetrabenazine binding site in rat brain synaptic vesicle by scintillation counting
In DepthDetails ArticlePubMed