BDBM50301347 CHEMBL579195::N-butyl-5-chloro-6-(4-(1-(4-chlorobenzyl)piperidin-4-yl)piperazin-1-yl)nicotinamide
SMILES CCCCNC(=O)c1cnc(N2CCN(CC2)C2CCN(Cc3ccc(Cl)cc3)CC2)c(Cl)c1
InChI Key InChIKey=UMFHHXDLQZXPTI-UHFFFAOYSA-N
Data  1 KI
  Tab Delimited (TSV)   2D SDfile   Computed 3D by Vconf -m prep SDfile
Find this compound or compounds like it in BindingDB:
Activity Spreadsheet -- Enzyme Inhibition Constant Data from BindingDB
Found 1 hit for monomerid = 50301347
TargetC-X-C chemokine receptor type 3(Homo sapiens (Human))
Ligand Pharmaceuticals
Curated by ChEMBL
LigandPNGBDBM50301347(CHEMBL579195 | N-butyl-5-chloro-6-(4-(1-(4-chlorob...)
Affinity DataKi:  370nM. Assay description: Displacement of 125I-IP10 from recombinant human CXCR3 receptor expressed in Ba/F3 cell membrane after 1 to 4 hrs by scintillation counting
In DepthDetails ArticlePubMed