BDBM50301974 2-(6-(3',5-bis(aminomethyl)biphenyl-3-yloxy)-3,5-difluoropyridin-2-yloxy)-4-methylbenzoic acid::CHEMBL571351
SMILES Cc1ccc(C(O)=O)c(Oc2nc(Oc3cc(CN)cc(c3)-c3cccc(CN)c3)c(F)cc2F)c1
InChI Key InChIKey=AJQCGECQIDFIDE-UHFFFAOYSA-N
Data  2 IC50
  Tab Delimited (TSV)   2D SDfile   Computed 3D by Vconf -m prep SDfile
Find this compound or compounds like it in BindingDB:
Activity Spreadsheet -- Enzyme Inhibition Constant Data from BindingDB
Found 2 hits for monomerid = 50301974
TargetUrokinase-type plasminogen activator(Homo sapiens (Human))
Berlex Biosciences
Curated by ChEMBL
LigandPNGBDBM50301974(2-(6-(3',5-bis(aminomethyl)biphenyl-3-yloxy)-3,5-d...)
Affinity DataIC50:  2.70E+3nM. Assay description: Inhibition of uPA
In DepthDetails ArticlePubMed
TargetPlasminogen(Homo sapiens (Human))
Berlex Biosciences
Curated by ChEMBL
LigandPNGBDBM50301974(2-(6-(3',5-bis(aminomethyl)biphenyl-3-yloxy)-3,5-d...)
Affinity DataIC50:  2.70E+3nM. Assay description: Inhibition of plasmin
In DepthDetails ArticlePubMed