BDBM50302227 4-(4-benzylpiperazin-1-yl)-2-(3,4-dimethoxybenzyl)isoindoline-1,3-dione::CHEMBL566187
SMILES COc1ccc(CN2C(=O)c3cccc(N4CCN(Cc5ccccc5)CC4)c3C2=O)cc1OC
InChI Key InChIKey=FARHQDUFBHCIDC-UHFFFAOYSA-N
Data  1 KI  1 IC50
  Tab Delimited (TSV)   2D SDfile   Computed 3D by Vconf -m prep SDfile
Find this compound or compounds like it in BindingDB:
Activity Spreadsheet -- Enzyme Inhibition Constant Data from BindingDB
Found 2 hits for monomerid = 50302227
TargetUrotensin-2 receptor(Homo sapiens (Human))
Johnson & Johnson Pharmaceutical Research & Development
Curated by ChEMBL
LigandPNGBDBM50302227(4-(4-benzylpiperazin-1-yl)-2-(3,4-dimethoxybenzyl)...)
Affinity DataKi:  160nM. Assay description: Displacement of [125I]urotensin 2 from urotensin 2 receptor in human RMS13 cells by scintillation proximity assay
In DepthDetails ArticlePubMed
TargetUrotensin-2 receptor(RAT)
Johnson & Johnson Pharmaceutical Research & Development
Curated by ChEMBL
LigandPNGBDBM50302227(4-(4-benzylpiperazin-1-yl)-2-(3,4-dimethoxybenzyl)...)
Affinity DataIC50:  150nM. Assay description: Antagonist activity at rat urotensin 2 receptor expressed in CHOK1 cells assessed as inhibition of urotensin 2-induced intracellular calcium mobiliza...
In DepthDetails ArticlePubMed