BDBM50302402 7-bromo-2-(2-chloro-6-fluorophenyl)-1H-phenanthro[9,10-d]imidazole::CHEMBL566261
SMILES Fc1cccc(Cl)c1-c1nc2c([nH]1)c1cccc(Br)c1c1ccccc21
InChI Key InChIKey=KLDPORRVVYLMRJ-UHFFFAOYSA-N
Data  2 IC50
  Tab Delimited (TSV)   2D SDfile   Computed 3D by Vconf -m prep SDfile
Find this compound or compounds like it in BindingDB:
Activity Spreadsheet -- Enzyme Inhibition Constant Data from BindingDB
Found 2 hits for monomerid = 50302402
TargetProstaglandin E synthase(Homo sapiens (Human))
Merck Frosst Centre For Therapeutic Research
Curated by ChEMBL
LigandPNGBDBM50302402(7-bromo-2-(2-chloro-6-fluorophenyl)-1H-phenanthro[...)
Affinity DataIC50:  8nM. Assay description: Displacement of [3H]PGH2 from human recombinant PGES1 expressed in CHOK1 cells
In DepthDetails ArticlePubMed
TargetProstaglandin E synthase(Homo sapiens (Human))
Merck Frosst Centre For Therapeutic Research
Curated by ChEMBL
LigandPNGBDBM50302402(7-bromo-2-(2-chloro-6-fluorophenyl)-1H-phenanthro[...)
Affinity DataIC50:  3.00E+3nM. Assay description: Inhibition of mPGES1 in IL-1beta-stimulated human A549 cells assessed as blockade of PGH2 to PGE2 conversion in presence of 50% fetal bovine serum
In DepthDetails ArticlePubMed