BDBM50302575 1-(4-methoxy-2-methylphenyl)-N-((S)-1-methoxybutan-2-yl)-3,6-dimethyl-1H-pyrazolo[3,4-d]pyrimidin-4-amine::CHEMBL577239
SMILES CC[C@@H](COC)Nc1nc(C)nc2n(nc(C)c12)-c1ccc(OC)cc1C
InChI Key InChIKey=YTAPRWQKBIKNCJ-HNNXBMFYSA-N
Data  1 KI
  Tab Delimited (TSV)   2D SDfile   Computed 3D by Vconf -m prep SDfile
Find this compound or compounds like it in BindingDB:
Activity Spreadsheet -- Enzyme Inhibition Constant Data from BindingDB
Found 1 hit for monomerid = 50302575
TargetCorticotropin-releasing factor receptor 1(Homo sapiens (Human))
Pfizer
Curated by ChEMBL
LigandPNGBDBM50302575(1-(4-methoxy-2-methylphenyl)-N-((S)-1-methoxybutan...)
Affinity DataKi:  135nM. Assay description: Antagonist activity at human recombinant CRF1 receptor expressed in CHO cells assessed as inhibition of CRF-induced cAMP production
In DepthDetails ArticlePubMed