BDBM50302590 CHEMBL566938::N-(1-(4-methoxy-2-methylphenyl)-3,6-dimethyl-1H-pyrazolo[3,4-d]pyrimidin-4-yl)-5-((propylamino)methyl)-1,2,4-oxadiazol-3-amine
SMILES CCCNCc1nc(Nc2nc(C)nc3n(nc(C)c23)-c2ccc(OC)cc2C)no1
InChI Key InChIKey=ZBYBLHMTZKBDHN-UHFFFAOYSA-N
Data  1 KI
  Tab Delimited (TSV)   2D SDfile   Computed 3D by Vconf -m prep SDfile
Find this compound or compounds like it in BindingDB:
Activity Spreadsheet -- Enzyme Inhibition Constant Data from BindingDB
Found 1 hit for monomerid = 50302590
TargetCorticotropin-releasing factor receptor 1(Homo sapiens (Human))
Pfizer
Curated by ChEMBL
LigandPNGBDBM50302590(CHEMBL566938 | N-(1-(4-methoxy-2-methylphenyl)-3,6...)
Affinity DataKi:  124nM. Assay description: Antagonist activity at human recombinant CRF1 receptor expressed in CHO cells assessed as inhibition of CRF-induced cAMP production
In DepthDetails ArticlePubMed