BDBM50303329 (2S)-2-{[3-(3'-[1,1'-Biphenyl]-4''-yl-4',5'-dihydro-5'-isoxazolyl)-2-{[hydroxyl(2-phenyl-(1R)-1-{[(benzyloxy)carbonyl]amino}ethyl)-phosphinyl]methyl}-1-oxopropyl]amino}1H-Indole-3-propanoic Acid::CHEMBL570722
SMILES OC(=O)[C@H](Cc1c[nH]c2ccccc12)NC(=O)C(CC1CC(=NO1)c1ccc(cc1)-c1ccccc1)CP(O)(=O)[C@H](Cc1ccccc1)NC(=O)OCc1ccccc1
InChI Key InChIKey=SICGILBDGWFFNA-FGIOIFSOSA-N
Data  3 KI
  Tab Delimited (TSV)   2D SDfile   Computed 3D by Vconf -m prep SDfile
Find this compound or compounds like it in BindingDB:
Activity Spreadsheet -- Enzyme Inhibition Constant Data from BindingDB
Found 3 hits for monomerid = 50303329
TargetAngiotensin-converting enzyme(Homo sapiens (Human))
Cea
Curated by ChEMBL
LigandPNGBDBM50303329((2S)-2-{[3-(3'-[1,1'-Biphenyl]-4''-yl-4',5'-dihydr...)
Affinity DataKi:  25nM. Assay description: Inhibition of human somatic ACE C-terminal domain
In DepthDetails ArticlePubMed
TargetNeprilysin(Homo sapiens (Human))
Cea
Curated by ChEMBL
LigandPNGBDBM50303329((2S)-2-{[3-(3'-[1,1'-Biphenyl]-4''-yl-4',5'-dihydr...)
Affinity DataKi: >1.00E+4nM. Assay description: Inhibition of human somatic NEP
In DepthDetails ArticlePubMed
TargetEndothelin-converting enzyme 1(Homo sapiens (Human))
Cea
Curated by ChEMBL
LigandPNGBDBM50303329((2S)-2-{[3-(3'-[1,1'-Biphenyl]-4''-yl-4',5'-dihydr...)
Affinity DataKi: >1.00E+4nM. Assay description: Inhibition of human somatic ECE1
In DepthDetails ArticlePubMed