BDBM50304082 3-(5-(3-tert-Butylphenyl)-3-((dimethylamino)methyl)-1H-1,2,4-triazol-1-yl)phenol::CHEMBL604903
SMILES CN(C)Cc1nc(-c2cccc(c2)C(C)(C)C)n(n1)-c1cccc(O)c1
InChI Key InChIKey=KCSVGZNJLCJIMI-UHFFFAOYSA-N
Data  3 IC50
  Tab Delimited (TSV)   2D SDfile   Computed 3D by Vconf -m prep SDfile
Find this compound or compounds like it in BindingDB:
Activity Spreadsheet -- Enzyme Inhibition Constant Data from BindingDB
Found 3 hits for monomerid = 50304082
TargetMu-type opioid receptor(MOUSE)
University Of Medicine And Dentistry Of New Jersey-Robert Wood Johnson Medical School And The Informatics Institute Of Umdnj
Curated by ChEMBL
LigandPNGBDBM50304082(3-(5-(3-tert-Butylphenyl)-3-((dimethylamino)methyl...)
Affinity DataIC50:  2.45E+3nM. Assay description: Displacement of [3H]bremazocine from mouse mu opioid receptor expressed in HEK293 cells by liquid scintillation counting
In DepthDetails ArticlePubMed
TargetDelta-type opioid receptor(MOUSE)
University Of Medicine And Dentistry Of New Jersey-Robert Wood Johnson Medical School And The Informatics Institute Of Umdnj
Curated by ChEMBL
LigandPNGBDBM50304082(3-(5-(3-tert-Butylphenyl)-3-((dimethylamino)methyl...)
Affinity DataIC50:  49nM. Assay description: Displacement of [3H]bremazocine from mouse delta opioid receptor expressed in HEK293 cells by liquid scintillation counting
In DepthDetails ArticlePubMed
TargetKappa-type opioid receptor(Rattus norvegicus (rat))
University Of Medicine And Dentistry Of New Jersey-Robert Wood Johnson Medical School And The Informatics Institute Of Umdnj
Curated by ChEMBL
LigandPNGBDBM50304082(3-(5-(3-tert-Butylphenyl)-3-((dimethylamino)methyl...)
Affinity DataIC50:  341nM. Assay description: Displacement of [3H]bremazocine from rat kappa opioid receptor expressed in HEK293 cells by liquid scintillation counting
In DepthDetails ArticlePubMed