BDBM50304804 7-(2-chlorophenoxy)-2-(piperazin-1-yl)-6,7-dihydro-5H-cyclopenta[b]pyridine::CHEMBL595195
SMILES Clc1ccccc1OC1CCc2ccc(nc12)N1CCNCC1
InChI Key InChIKey=HUUPVTVQRVHGPI-UHFFFAOYSA-N
Data  2 KI  3 EC50
  Tab Delimited (TSV)   2D SDfile   Computed 3D by Vconf -m prep SDfile
Find this compound or compounds like it in BindingDB:
Activity Spreadsheet -- Enzyme Inhibition Constant Data from BindingDB
Found 5 hits for monomerid = 50304804
Target5-hydroxytryptamine receptor 2C(Homo sapiens (Human))
Pfizer
Curated by ChEMBL
LigandPNGBDBM50304804(7-(2-chlorophenoxy)-2-(piperazin-1-yl)-6,7-dihydro...)
Affinity DataKi:  0.900nM. Assay description: Agonist activity against human 5HT2C receptor by FLIPR assay relative to 5HT
In DepthDetails ArticlePubMed
Target5-hydroxytryptamine receptor 2A(Rattus norvegicus (rat))
Pfizer
Curated by ChEMBL
LigandPNGBDBM50304804(7-(2-chlorophenoxy)-2-(piperazin-1-yl)-6,7-dihydro...)
Affinity DataKi:  3.80nM. Assay description: Displacement of [125I]DOI from rat 5HT2A receptor expressed in mouse 3T3 cells
In DepthDetails ArticlePubMed
Target5-hydroxytryptamine receptor 2A(Homo sapiens (Human))
Pfizer
Curated by ChEMBL
LigandPNGBDBM50304804(7-(2-chlorophenoxy)-2-(piperazin-1-yl)-6,7-dihydro...)
Affinity DataEC50:  236nM. Assay description: Agonist activity against human 5HT2A receptor by FLIPR assay
In DepthDetails ArticlePubMed
Target5-hydroxytryptamine receptor 2B(Homo sapiens (Human))
Pfizer
Curated by ChEMBL
LigandPNGBDBM50304804(7-(2-chlorophenoxy)-2-(piperazin-1-yl)-6,7-dihydro...)
Affinity DataEC50:  187nM. Assay description: Agonist activity against human 5HT2B receptor by FLIPR assay
In DepthDetails ArticlePubMed
Target5-hydroxytryptamine receptor 2C(Homo sapiens (Human))
Pfizer
Curated by ChEMBL
LigandPNGBDBM50304804(7-(2-chlorophenoxy)-2-(piperazin-1-yl)-6,7-dihydro...)
Affinity DataEC50:  0.100nM. Assay description: Agonist activity against human 5HT2C receptor by FLIPR assay
In DepthDetails ArticlePubMed