BDBM50304845 4-(3-aminophenyl)-1,2-dimethyl-5-(quinoxalin-6-yl)-1H-pyrazol-3(2H)-one::CHEMBL603851
SMILES Cn1c(c(-c2cccc(N)c2)c(=O)n1C)-c1ccc2nccnc2c1
InChI Key InChIKey=DHZPFNWYOKQHND-UHFFFAOYSA-N
Data  1 KI  1 IC50
  Tab Delimited (TSV)   2D SDfile   Computed 3D by Vconf -m prep SDfile
Find this compound or compounds like it in BindingDB:
Activity Spreadsheet -- Enzyme Inhibition Constant Data from BindingDB
Found 2 hits for monomerid = 50304845
TargetTGF-beta receptor type-1(Homo sapiens (Human))
Biogen Idec
Curated by ChEMBL
LigandPNGBDBM50304845(4-(3-aminophenyl)-1,2-dimethyl-5-(quinoxalin-6-yl)...)
Affinity DataKi:  1.30E+5nM. Assay description: Displacement of [3H]HTS446284 from human recombinant His-tagged TGFbetaR1 after 1 hr by scintillation counting
In DepthDetails ArticlePubMed
TargetTGF-beta receptor type-1(Homo sapiens (Human))
Biogen Idec
Curated by ChEMBL
LigandPNGBDBM50304845(4-(3-aminophenyl)-1,2-dimethyl-5-(quinoxalin-6-yl)...)
Affinity DataIC50: >1.00E+4nM. Assay description: Inhibition of TGFR-1 in human HepG2 cells expressing PAI-luciferase by luciferase reporter gene assay
In DepthDetails ArticlePubMed