BDBM50305826 4-((3-(3-methoxybenzylcarbamoyl)benzamido)methyl)benzoic acid::CHEMBL596494
SMILES COc1cccc(CNC(=O)c2cccc(c2)C(=O)NCc2ccc(cc2)C(O)=O)c1
InChI Key InChIKey=FSCMLHMAYBLEAH-UHFFFAOYSA-N
Data  2 IC50
  Tab Delimited (TSV)   2D SDfile   Computed 3D by Vconf -m prep SDfile
Find this compound or compounds like it in BindingDB:
Activity Spreadsheet -- Enzyme Inhibition Constant Data from BindingDB
Found 2 hits for monomerid = 50305826
TargetCollagenase 3(Homo sapiens (Human))
Pfizer
Curated by ChEMBL
LigandPNGBDBM50305826(4-((3-(3-methoxybenzylcarbamoyl)benzamido)methyl)b...)
Affinity DataIC50:  1.70E+3nM. Assay description: Inhibition of human recombinant full length MMP13 assessed as type 3 collagen cleavage activity after 18 hrs
In DepthDetails ArticlePubMed
TargetCollagenase 3(Homo sapiens (Human))
Pfizer
Curated by ChEMBL
LigandPNGBDBM50305826(4-((3-(3-methoxybenzylcarbamoyl)benzamido)methyl)b...)
Affinity DataIC50:  77nM. Assay description: Inhibition of human recombinant MMP13 catalytic domain
In DepthDetails ArticlePubMed