BDBM50306058 1-(3-(3-(ethylsulfonyl)phenoxy)phenyl)-2-methyl-4-(trifluoromethyl)-1H-benzo[d]imidazole::CHEMBL595483
SMILES CCS(=O)(=O)c1cccc(Oc2cccc(c2)-n2c(C)nc3c(cccc23)C(F)(F)F)c1
InChI Key InChIKey=PZJQTRGWISHVPT-UHFFFAOYSA-N
Data  2 IC50
  Tab Delimited (TSV)   2D SDfile   Computed 3D by Vconf -m prep SDfile
Find this compound or compounds like it in BindingDB:
Activity Spreadsheet -- Enzyme Inhibition Constant Data from BindingDB
Found 2 hits for monomerid = 50306058
TargetOxysterols receptor LXR-alpha(Homo sapiens (Human))
Wyeth Pharmaceuticals
Curated by ChEMBL
LigandPNGBDBM50306058(1-(3-(3-(ethylsulfonyl)phenoxy)phenyl)-2-methyl-4-...)
Affinity DataIC50:  5.70nM. Assay description: Displacement of [3H]T0901317 from human recombinant LXRalpha LBD
In DepthDetails ArticlePubMed
TargetOxysterols receptor LXR-beta(Homo sapiens (Human))
Wyeth Pharmaceuticals
Curated by ChEMBL
LigandPNGBDBM50306058(1-(3-(3-(ethylsulfonyl)phenoxy)phenyl)-2-methyl-4-...)
Affinity DataIC50:  128nM. Assay description: Displacement of [3H]T0901317 from human recombinant LXRbeta LBD
In DepthDetails ArticlePubMed