BDBM50306421 2-{1'-[(adamantan-2-yl)carbamoyl]-2,3-dihydrospiro[indene-1,4'-piperidine]-3-yl}acetic acid::CHEMBL598675
SMILES OC(=O)CC1CC2(CCN(CC2)C(=O)NC2C3CC4CC(C3)CC2C4)c2ccccc12
InChI Key InChIKey=GMKSWUJYABRINI-UHFFFAOYSA-N
Data  9 IC50
  Tab Delimited (TSV)   2D SDfile   Computed 3D by Vconf -m prep SDfile
Find this compound or compounds like it in BindingDB:
Activity Spreadsheet -- Enzyme Inhibition Constant Data from BindingDB
Found 9 hits for monomerid = 50306421
Target11-beta-hydroxysteroid dehydrogenase 1(Homo sapiens (Human))
Vitae Pharmaceuticals
Curated by ChEMBL
LigandPNGBDBM50306421(2-{1'-[(adamantan-2-yl)carbamoyl]-2,3-dihydrospiro...)
Affinity DataIC50:  16.1nM. Assay description: Inhibition of human recombinant 11beta-HSD1 expressed in CHO cells assessed as conversion of [3H]cortisone to [3H]cortisol by SPA
In DepthDetails ArticlePubMed
Target11-beta-hydroxysteroid dehydrogenase 1(Homo sapiens (Human))
Vitae Pharmaceuticals
Curated by ChEMBL
LigandPNGBDBM50306421(2-{1'-[(adamantan-2-yl)carbamoyl]-2,3-dihydrospiro...)
Affinity DataIC50:  16.1nM. Assay description: Inhibition of human recombinant 11beta-HSD1 expressed in CHO cells assessed as conversion of [3H]cortisone to [3H]cortisol by SPA
In DepthDetails ArticlePubMed
Target11-beta-hydroxysteroid dehydrogenase 1(Homo sapiens (Human))
Vitae Pharmaceuticals
Curated by ChEMBL
LigandPNGBDBM50306421(2-{1'-[(adamantan-2-yl)carbamoyl]-2,3-dihydrospiro...)
Affinity DataIC50:  16.5nM. Assay description: Inhibition of human recombinant 11beta-HSD1 expressed in CHO cells assessed as conversion of [3H]cortisone to [3H]cortisol by SPA
In DepthDetails ArticlePubMed
Target11-beta-hydroxysteroid dehydrogenase 1(Homo sapiens (Human))
Vitae Pharmaceuticals
Curated by ChEMBL
LigandPNGBDBM50306421(2-{1'-[(adamantan-2-yl)carbamoyl]-2,3-dihydrospiro...)
Affinity DataIC50:  60.3nM. Assay description: Inhibition of 11beta-HSD1 in human adipocytes assessed as conversion of [3H]cortisone to [3H]cortisol after 2 hrs by SPA
In DepthDetails ArticlePubMed
Target11-beta-hydroxysteroid dehydrogenase type 2(Homo sapiens (Human))
Vitae Pharmaceuticals
Curated by ChEMBL
LigandPNGBDBM50306421(2-{1'-[(adamantan-2-yl)carbamoyl]-2,3-dihydrospiro...)
Affinity DataIC50:  5.90E+3nM. Assay description: Inhibition of 11beta-HSD2
In DepthDetails ArticlePubMed
Target11-beta-hydroxysteroid dehydrogenase 1(Homo sapiens (Human))
Vitae Pharmaceuticals
Curated by ChEMBL
LigandPNGBDBM50306421(2-{1'-[(adamantan-2-yl)carbamoyl]-2,3-dihydrospiro...)
Affinity DataIC50:  57.8nM. Assay description: Inhibition of 11beta-HSD1 in human adipocytes assessed as conversion of [3H]cortisone to [3H]cortisol after 2 hrs by SPA
In DepthDetails ArticlePubMed
Target11-beta-hydroxysteroid dehydrogenase type 2(Homo sapiens (Human))
Vitae Pharmaceuticals
Curated by ChEMBL
LigandPNGBDBM50306421(2-{1'-[(adamantan-2-yl)carbamoyl]-2,3-dihydrospiro...)
Affinity DataIC50: >1.00E+4nM. Assay description: Inhibition of 11beta-HSD2
In DepthDetails ArticlePubMed
Target11-beta-hydroxysteroid dehydrogenase type 2(Homo sapiens (Human))
Vitae Pharmaceuticals
Curated by ChEMBL
LigandPNGBDBM50306421(2-{1'-[(adamantan-2-yl)carbamoyl]-2,3-dihydrospiro...)
Affinity DataIC50:  5.90E+3nM. Assay description: Inhibition of 11beta-HSD2
In DepthDetails ArticlePubMed
Target11-beta-hydroxysteroid dehydrogenase 1(Homo sapiens (Human))
Vitae Pharmaceuticals
Curated by ChEMBL
LigandPNGBDBM50306421(2-{1'-[(adamantan-2-yl)carbamoyl]-2,3-dihydrospiro...)
Affinity DataIC50:  60.3nM. Assay description: Inhibition of 11beta-HSD1 in human adipocytes assessed as conversion of [3H]cortisone to [3H]cortisol after 2 hrs by SPA
In DepthDetails ArticlePubMed