BDBM50306429 2-{1'-[(adamantan-2-yl)carbamoyl]-7-bromo-2,3-dihydrospiro[indene-1,4'-piperidine]-3-yl}acetic acid::CHEMBL605162
SMILES OC(=O)CC1CC2(CCN(CC2)C(=O)NC2C3CC4CC(C3)CC2C4)c2c1cccc2Br
InChI Key InChIKey=GWEYXGKHUJIVFK-UHFFFAOYSA-N
Data  6 IC50
  Tab Delimited (TSV)   2D SDfile   Computed 3D by Vconf -m prep SDfile
Find this compound or compounds like it in BindingDB:
Activity Spreadsheet -- Enzyme Inhibition Constant Data from BindingDB
Found 6 hits for monomerid = 50306429
Target11-beta-hydroxysteroid dehydrogenase 1(Homo sapiens (Human))
Vitae Pharmaceuticals
Curated by ChEMBL
LigandPNGBDBM50306429(2-{1'-[(adamantan-2-yl)carbamoyl]-7-bromo-2,3-dihy...)
Affinity DataIC50:  1.60nM. Assay description: Inhibition of human recombinant 11beta-HSD1 expressed in CHO cells assessed as conversion of [3H]cortisone to [3H]cortisol by SPA
In DepthDetails ArticlePubMed
Target11-beta-hydroxysteroid dehydrogenase 1(Homo sapiens (Human))
Vitae Pharmaceuticals
Curated by ChEMBL
LigandPNGBDBM50306429(2-{1'-[(adamantan-2-yl)carbamoyl]-7-bromo-2,3-dihy...)
Affinity DataIC50:  5.30nM. Assay description: Inhibition of 11beta-HSD1 in human adipocytes assessed as conversion of [3H]cortisone to [3H]cortisol after 2 hrs by SPA
In DepthDetails ArticlePubMed
TargetCytochrome P450 2D6(Homo sapiens (Human))
Vitae Pharmaceuticals
Curated by ChEMBL
LigandPNGBDBM50306429(2-{1'-[(adamantan-2-yl)carbamoyl]-7-bromo-2,3-dihy...)
Affinity DataIC50: >1.50E+4nM. Assay description: Inhibition of CYP2D6
In DepthDetails ArticlePubMed
TargetCytochrome P450 3A4(Homo sapiens (Human))
Vitae Pharmaceuticals
Curated by ChEMBL
LigandPNGBDBM50306429(2-{1'-[(adamantan-2-yl)carbamoyl]-7-bromo-2,3-dihy...)
Affinity DataIC50: >1.50E+4nM. Assay description: Inhibition of CYP3A4
In DepthDetails ArticlePubMed
TargetCytochrome P450 2C9(Homo sapiens (Human))
Vitae Pharmaceuticals
Curated by ChEMBL
LigandPNGBDBM50306429(2-{1'-[(adamantan-2-yl)carbamoyl]-7-bromo-2,3-dihy...)
Affinity DataIC50: >1.50E+4nM. Assay description: Inhibition of CYP2C9
In DepthDetails ArticlePubMed
Target11-beta-hydroxysteroid dehydrogenase type 2(Homo sapiens (Human))
Vitae Pharmaceuticals
Curated by ChEMBL
LigandPNGBDBM50306429(2-{1'-[(adamantan-2-yl)carbamoyl]-7-bromo-2,3-dihy...)
Affinity DataIC50: >1.00E+4nM. Assay description: Inhibition of 11beta-HSD2
In DepthDetails ArticlePubMed