BDBM50306449 (6aS,13bS)-11-chloro-4-(4-(dimethylamino)phenyl)-7-methyl-6,6a,7,8,9,13b-hexahydro-5H-benzo[d]naphtho[2,1-b]azepin-12-ol::CHEMBL597310
SMILES CN(C)c1ccc(cc1)-c1cccc2[C@H]3[C@H](CCc12)N(C)CCc1cc(Cl)c(O)cc31
InChI Key InChIKey=KMTWVLYZPPJEHR-AHKZPQOWSA-N
Data  2 KI
  Tab Delimited (TSV)   2D SDfile   Computed 3D by Vconf -m prep SDfile
Find this compound or compounds like it in BindingDB:
Activity Spreadsheet -- Enzyme Inhibition Constant Data from BindingDB
Found 2 hits for monomerid = 50306449
TargetD(1A) dopamine receptor(Homo sapiens (Human))
Merck Research Laboratories
Curated by ChEMBL
LigandPNGBDBM50306449((6aS,13bS)-11-chloro-4-(4-(dimethylamino)phenyl)-7...)
Affinity DataKi:  0.700nM. Assay description: Displacement of [3H]SCh23390 from dopamine D1 receptor expressed in mouse LTK cells by scintillation counting
In DepthDetails ArticlePubMed
TargetD(2) dopamine receptor(Homo sapiens (Human))
Merck Research Laboratories
Curated by ChEMBL
LigandPNGBDBM50306449((6aS,13bS)-11-chloro-4-(4-(dimethylamino)phenyl)-7...)
Affinity DataKi:  12nM. Assay description: Displacement of [3H]methylspiperon from dopamine D2 receptor expressed in mouse LTK cells by scintillation counting
In DepthDetails ArticlePubMed