BDBM50306563 (2S,3R,4S,5S,6R)-2-acetamido-3,4,5-trihydroxy-6-(hydroxymethyl)tetrahydro-2H-pyran-2-carboxamide::1-DEOXY-1-ACETYLAMINO-BETA-D-GLUCO-2-HEPTULOPYRANOSONAMIDE::CHEMBL592878
SMILES CC(=O)N[C@@]1(O[C@H](CO)[C@@H](O)[C@H](O)[C@H]1O)C(N)=O
InChI Key InChIKey=BUPVODXECQDZQR-YCOWOFQRSA-N
Data  1 KI
PDB links: 2 PDB IDs match this monomer.
  Tab Delimited (TSV)   2D SDfile   Computed 3D by Vconf -m prep SDfile
Find this compound or compounds like it in BindingDB:
Activity Spreadsheet -- Enzyme Inhibition Constant Data from BindingDB
Found 1 hit for monomerid = 50306563
TargetGlycogen phosphorylase, muscle form(Oryctolagus cuniculus (rabbit))
University Of Debrecen
Curated by ChEMBL
LigandPNGBDBM50306563((2S,3R,4S,5S,6R)-2-acetamido-3,4,5-trihydroxy-6-(h...)
Affinity DataKi:  3.10E+5nM. Assay description: Inhibition of rabbit skeletal muscle glycogen phosphorylase b