BDBM503073 N-[2-(1-benzylpiperidin-4-yl)ethyl]-1-[4- (trifluoromethyl)phenyl]piperidine-4-carboxamide::US11033539, Cpd. No. 10-9
SMILES FC(F)(F)c1ccc(cc1)N1CCC(CC1)C(=O)NCCC1CCN(Cc2ccccc2)CC1
InChI Key InChIKey=UURIJXNRGLTSFK-UHFFFAOYSA-N
Data  5 KI
  Tab Delimited (TSV)   2D SDfile   Computed 3D by Vconf -m prep SDfile
Find this compound or compounds like it in BindingDB:
Activity Spreadsheet -- Enzyme Inhibition Constant Data from BindingDB
Found 5 hits for monomerid = 503073
TargetMuscarinic acetylcholine receptor M4(Homo sapiens (Human))
Neurocrine Biosciences
US Patent
LigandPNGBDBM503073(N-[2-(1-benzylpiperidin-4-yl)ethyl]-1-[4- (trifluo...)
Affinity DataKi: <10nM. Assay description: Binding affinity (Ki) of compounds was measured by inhibition of radioligand binding to membranes from CHO cells expressing human M1, M2, M3, M4 and ...
Ligand InfoPC cidPC sid
In DepthDetails US Patent
TargetMuscarinic acetylcholine receptor M1(Homo sapiens (Human))
Neurocrine Biosciences
US Patent
LigandPNGBDBM503073(N-[2-(1-benzylpiperidin-4-yl)ethyl]-1-[4- (trifluo...)
Affinity DataKi: >100nM. Assay description: Binding affinity (Ki) of compounds was measured by inhibition of radioligand binding to membranes from CHO cells expressing human M1, M2, M3, M4 and ...
Ligand InfoPC cidPC sid
In DepthDetails US Patent
TargetMuscarinic acetylcholine receptor M5(Homo sapiens (Human))
Neurocrine Biosciences
US Patent
LigandPNGBDBM503073(N-[2-(1-benzylpiperidin-4-yl)ethyl]-1-[4- (trifluo...)
Affinity DataKi: >100nM. Assay description: Binding affinity (Ki) of compounds was measured by inhibition of radioligand binding to membranes from CHO cells expressing human M1, M2, M3, M4 and ...
Ligand InfoPC cidPC sid
In DepthDetails US Patent
TargetMuscarinic acetylcholine receptor M3(Homo sapiens (Human))
Neurocrine Biosciences
US Patent
LigandPNGBDBM503073(N-[2-(1-benzylpiperidin-4-yl)ethyl]-1-[4- (trifluo...)
Affinity DataKi: >100nM. Assay description: Binding affinity (Ki) of compounds was measured by inhibition of radioligand binding to membranes from CHO cells expressing human M1, M2, M3, M4 and ...
Ligand InfoPC cidPC sid
In DepthDetails US Patent
TargetMuscarinic acetylcholine receptor M2(Homo sapiens (Human))
Neurocrine Biosciences
US Patent
LigandPNGBDBM503073(N-[2-(1-benzylpiperidin-4-yl)ethyl]-1-[4- (trifluo...)
Affinity DataKi:  550nM. Assay description: Binding affinity (Ki) of compounds was measured by inhibition of radioligand binding to membranes from CHO cells expressing human M1, M2, M3, M4 and ...
Ligand InfoPC cidPC sid
In DepthDetails US Patent