BDBM50308968 1-(4-octylphenoxy)-3-(1H-pyrazol-1-yl)propan-2-one::CHEMBL592145
SMILES CCCCCCCCc1ccc(OCC(=O)Cn2cccn2)cc1
InChI Key InChIKey=WOXAPYHMWSRUHR-UHFFFAOYSA-N
Data  3 IC50
  Tab Delimited (TSV)   2D SDfile   Computed 3D by Vconf -m prep SDfile
Find this compound or compounds like it in BindingDB:
Activity Spreadsheet -- Enzyme Inhibition Constant Data from BindingDB
Found 3 hits for monomerid = 50308968
TargetCytosolic phospholipase A2(Homo sapiens (Human))
University Of M£Nster
Curated by ChEMBL
LigandPNGBDBM50308968(1-(4-octylphenoxy)-3-(1H-pyrazol-1-yl)propan-2-one...)
Affinity DataIC50: >1.00E+4nM. Assay description: Inhibition of cPLA2 from human platelets by RP-HPLC
In DepthDetails ArticlePubMed
TargetFatty-acid amide hydrolase 1 [30-579](Rattus norvegicus (rat))
University Of M£Nster
Curated by ChEMBL
LigandPNGBDBM50308968(1-(4-octylphenoxy)-3-(1H-pyrazol-1-yl)propan-2-one...)
Affinity DataIC50:  840nM. Assay description: Inhibition of FAAH in rat brain microsomes using N-(2-hydroxyethyl)-4-pyren-1-ylbutanamide as substrate after 60 mins by fluorescence-based reversed ...
In DepthDetails ArticlePubMed
TargetFatty-acid amide hydrolase 1 [30-579](Rattus norvegicus (rat))
University Of M£Nster
Curated by ChEMBL
LigandPNGBDBM50308968(1-(4-octylphenoxy)-3-(1H-pyrazol-1-yl)propan-2-one...)
Affinity DataIC50:  2.00E+3nM. Assay description: Inhibition of FAAH from rat brain microsomes by RP-HPLC
In DepthDetails ArticlePubMed