BDBM50308975 1-[3-(4-Octylphenoxy)-2-oxopropyl]imidazole-4-carboxylic acid::CHEMBL598362
SMILES CCCCCCCCc1ccc(OCC(=O)Cn2cnc(c2)C(O)=O)cc1
InChI Key InChIKey=FKDOIKNFLOUWRC-UHFFFAOYSA-N
Data  2 IC50
  Tab Delimited (TSV)   2D SDfile   Computed 3D by Vconf -m prep SDfile
Find this compound or compounds like it in BindingDB:
Activity Spreadsheet -- Enzyme Inhibition Constant Data from BindingDB
Found 2 hits for monomerid = 50308975
TargetCytosolic phospholipase A2(Homo sapiens (Human))
University Of M£Nster
Curated by ChEMBL
LigandPNGBDBM50308975(1-[3-(4-Octylphenoxy)-2-oxopropyl]imidazole-4-carb...)
Affinity DataIC50:  5.30E+3nM. Assay description: Inhibition of cPLA2 from human platelets by RP-HPLC
In DepthDetails ArticlePubMed
TargetFatty-acid amide hydrolase 1 [30-579](Rattus norvegicus (rat))
University Of M£Nster
Curated by ChEMBL
LigandPNGBDBM50308975(1-[3-(4-Octylphenoxy)-2-oxopropyl]imidazole-4-carb...)
Affinity DataIC50:  1.90E+3nM. Assay description: Inhibition of FAAH from rat brain microsomes by RP-HPLC
In DepthDetails ArticlePubMed