BDBM50309794 (1S,2R,3S,4R,5S)-6-(3-Chlorobenzylamino)-(2-(6-(1-(4-isothiocyante-phenyl)-1H-1,2,3-triazol-4-yl)hex-1-ynyl)-9H-purin-9-yl)-2',3'-dihydroxybicyclo[3.1.0]hexane-1'-carboxylic acid N-methylamide::CHEMBL602844
SMILES CNC(=O)[C@@]12C[C@@H]1[C@H]([C@H](O)[C@@H]2O)n1cnc2c(NCc3cccc(Cl)c3)nc(nc12)C#CCCCCc1cn(nn1)-c1ccc(cc1)N=C=S
InChI Key InChIKey=UMBVSYQJMHGANC-SFOSGKPKSA-N
Data  1 KI
  Tab Delimited (TSV)   2D SDfile   Computed 3D by Vconf -m prep SDfile
Find this compound or compounds like it in BindingDB:
Activity Spreadsheet -- Enzyme Inhibition Constant Data from BindingDB
Found 1 hit for monomerid = 50309794
TargetAdenosine receptor A3(Homo sapiens (Human))
Niddk
Curated by ChEMBL
LigandPNGBDBM50309794((1S,2R,3S,4R,5S)-6-(3-Chlorobenzylamino)-(2-(6-(1-...)
Affinity DataKi:  37.5nM. Assay description: Displacement of [3H]I-AB-MECA from human recombinant adenosine A3 receptor expressed in CHO cells by liquid scintillation counting
In DepthDetails ArticlePubMed