BDBM50310472 CHEMBL1080073::methyl 2-(4-amino-1,2,5-oxadiazol-3-yl)-1-cyclobutyl-1H-benzo[d]imidazole-5-carboxylate
SMILES COC(=O)c1ccc2n(C3CCC3)c(nc2c1)-c1nonc1N
InChI Key InChIKey=BRAKSBIYJHCMPL-UHFFFAOYSA-N
Data  4 KI
  Tab Delimited (TSV)   2D SDfile   Computed 3D by Vconf -m prep SDfile
Find this compound or compounds like it in BindingDB:
Activity Spreadsheet -- Enzyme Inhibition Constant Data from BindingDB
Found 4 hits for monomerid = 50310472
TargetRibosomal protein S6 kinase beta-1(Homo sapiens (Human))
Vertex Pharmaceuticals
Curated by ChEMBL
LigandPNGBDBM50310472(CHEMBL1080073 | methyl 2-(4-amino-1,2,5-oxadiazol-...)
Affinity DataKi:  410nM. Assay description: Inhibition of p70S6K assessed as decrease in NADH absorbance at 340 nm in the presence of
In DepthDetails ArticlePubMed
TargetGlycogen synthase kinase-3 beta(Homo sapiens (Human))
Vertex Pharmaceuticals
Curated by ChEMBL
LigandPNGBDBM50310472(CHEMBL1080073 | methyl 2-(4-amino-1,2,5-oxadiazol-...)
Affinity DataKi: >3.30E+3nM. Assay description: Inhibition of GSK3beta assessed as decrease in NADH absorbance at 340 nm in the presence of
In DepthDetails ArticlePubMed
TargetRho-associated protein kinase 1(Homo sapiens (Human))
Vertex Pharmaceuticals
Curated by ChEMBL
LigandPNGBDBM50310472(CHEMBL1080073 | methyl 2-(4-amino-1,2,5-oxadiazol-...)
Affinity DataKi: >3.30E+3nM. Assay description: Inhibition of ROCK1 assessed as decrease in NADH absorbance at 340 nm in the presence of
In DepthDetails ArticlePubMed
TargetcAMP-dependent protein kinase catalytic subunit alpha(Homo sapiens (Human))
Vertex Pharmaceuticals
Curated by ChEMBL
LigandPNGBDBM50310472(CHEMBL1080073 | methyl 2-(4-amino-1,2,5-oxadiazol-...)
Affinity DataKi: >3.30E+3nM. Assay description: Inhibition of PKAalpha assessed as decrease in NADH absorbance at 340 nm in the presence of
In DepthDetails ArticlePubMed