BDBM50310639 CHEMBL1080064::N-(4-(3-(5-tert-butylisoxazol-3-yl)ureido)phenyl)isoquinoline-1-carboxamide
SMILES CC(C)(C)c1cc(NC(=O)Nc2ccc(NC(=O)c3nccc4ccccc34)cc2)no1
InChI Key InChIKey=YXVUAHGIBRKAGD-UHFFFAOYSA-N
Data  1 Kd
  Tab Delimited (TSV)   2D SDfile   Computed 3D by Vconf -m prep SDfile
Find this compound or compounds like it in BindingDB:
Activity Spreadsheet -- Enzyme Inhibition Constant Data from BindingDB
Found 1 hit for monomerid = 50310639
TargetReceptor-type tyrosine-protein kinase FLT3(Homo sapiens (Human))
Ambit Biosciences
Curated by ChEMBL
LigandPNGBDBM50310639(CHEMBL1080064 | N-(4-(3-(5-tert-butylisoxazol-3-yl...)
Affinity DataKd:  0.740nM. Assay description: Binding affinity to FLT3
In DepthDetails ArticlePubMed