BDBM50311048 10-chloro-3-fluoro-9H-benzo[f]imidazo[1,5-a][1,2,4]triazolo[1,5-d][1,4]diazepine::CHEMBL1077416
SMILES Fc1ccc-2c(c1)-c1ncnn1Cc1c(Cl)ncn-21
InChI Key InChIKey=XXAHGANHKMWQKV-UHFFFAOYSA-N
Data  1 KI
  Tab Delimited (TSV)   2D SDfile   Computed 3D by Vconf -m prep SDfile
Find this compound or compounds like it in BindingDB:
Activity Spreadsheet -- Enzyme Inhibition Constant Data from BindingDB
Found 1 hit for monomerid = 50311048
TargetGABA-A receptor; alpha-5/beta-3/gamma-2(Homo sapiens (Human))
F. Hoffmann-La Roche
Curated by ChEMBL
LigandPNGBDBM50311048(10-chloro-3-fluoro-9H-benzo[f]imidazo[1,5-a][1,2,4...)
Affinity DataKi:  0.300nM. Assay description: Displacement of [3H]Flumazenil from human GABAalpha5beta3gamma2 receptor expressed in insect SF9 cells
In DepthDetails ArticlePubMed