BDBM50312239 (4-(cyclopentylcarbamoyl)phenyl)difluoromethylphosphonic acid::CHEMBL1081935
SMILES OP(O)(=O)C(F)(F)c1ccc(cc1)C(=O)NC1CCCC1
InChI Key InChIKey=KFVZCGARJKUKLL-UHFFFAOYSA-N
Data  1 KI
  Tab Delimited (TSV)   2D SDfile   Computed 3D by Vconf -m prep SDfile
Find this compound or compounds like it in BindingDB:
Activity Spreadsheet -- Enzyme Inhibition Constant Data from BindingDB
Found 1 hit for monomerid = 50312239
TargetLow molecular weight protein-tyrosine phosphatase A(Mycobacterium tuberculosis)
University Of California
Curated by ChEMBL
LigandPNGBDBM50312239((4-(cyclopentylcarbamoyl)phenyl)difluoromethylphos...)
Affinity DataKi:  7.24E+4nM. Assay description: Inhibition of Mycobacterium tuberculosis PtpA
In DepthDetails ArticlePubMed