BDBM50312264 CHEMBL1079845::difluoro(4-(phenoxymethyl)phenyl)methylphosphonic acid
SMILES OP(O)(=O)C(F)(F)c1ccc(COc2ccccc2)cc1
InChI Key InChIKey=JSDRUQSMSCBURT-UHFFFAOYSA-N
Data  1 KI
  Tab Delimited (TSV)   2D SDfile   Computed 3D by Vconf -m prep SDfile
Find this compound or compounds like it in BindingDB:
Activity Spreadsheet -- Enzyme Inhibition Constant Data from BindingDB
Found 1 hit for monomerid = 50312264
TargetLow molecular weight protein-tyrosine phosphatase A(Mycobacterium tuberculosis)
University Of California
Curated by ChEMBL
LigandPNGBDBM50312264(CHEMBL1079845 | difluoro(4-(phenoxymethyl)phenyl)m...)
Affinity DataKi: >1.00E+5nM. Assay description: Inhibition of Mycobacterium tuberculosis PtpA
In DepthDetails ArticlePubMed