BDBM50312651 1-{N-[2-(Amidinoaminooxy)ethyl]amino}carbonylmethyl-6-methyl-3-[2,2-difluoro-2-phenylethylamino]pyrazinone::CHEMBL1083499::RWJ-671818
SMILES [#6]-c1cnc(-[#7]-[#6]C(F)(F)c2ccccc2)c(=O)n1-[#6]-[#6](=O)-[#7]-[#6]-[#6]-[#8]\[#7]=[#6](\[#7])-[#7]
InChI Key InChIKey=IDCKXHIGLKQWMM-UHFFFAOYSA-N
Data  9 KI
  Tab Delimited (TSV)   2D SDfile   Computed 3D by Vconf -m prep SDfile
Find this compound or compounds like it in BindingDB:
Activity Spreadsheet -- Enzyme Inhibition Constant Data from BindingDB
Found 9 hits for monomerid = 50312651
TargetProthrombin(Homo sapiens (Human))
Johnson & Johnson Pharmaceutical Research And Development
Curated by ChEMBL
LigandPNGBDBM50312651(1-{N-[2-(Amidinoaminooxy)ethyl]amino}carbonylmethy...)
Affinity DataKi:  1.30nM. Assay description: Inhibition of human alpha-thrombin
In DepthDetails ArticlePubMed
TargetTissue-type plasminogen activator(Homo sapiens (Human))
Johnson & Johnson Pharmaceutical Research And Development
Curated by ChEMBL
LigandPNGBDBM50312651(1-{N-[2-(Amidinoaminooxy)ethyl]amino}carbonylmethy...)
Affinity DataKi:  2.40E+3nM. Assay description: Inhibition of tissue-type plasminogen activator
In DepthDetails ArticlePubMed
TargetCoagulation factor X(Homo sapiens (Human))
Johnson & Johnson Pharmaceutical Research And Development
Curated by ChEMBL
LigandPNGBDBM50312651(1-{N-[2-(Amidinoaminooxy)ethyl]amino}carbonylmethy...)
Affinity DataKi:  3.30E+3nM. Assay description: Inhibition of human factor 10a
In DepthDetails ArticlePubMed
TargetChymase(Homo sapiens (Human))
Johnson & Johnson Pharmaceutical Research And Development
Curated by ChEMBL
LigandPNGBDBM50312651(1-{N-[2-(Amidinoaminooxy)ethyl]amino}carbonylmethy...)
Affinity DataKi: >2.60E+4nM. Assay description: Inhibition of chymase
In DepthDetails ArticlePubMed
TargetPlasminogen(Homo sapiens (Human))
Johnson & Johnson Pharmaceutical Research And Development
Curated by ChEMBL
LigandPNGBDBM50312651(1-{N-[2-(Amidinoaminooxy)ethyl]amino}carbonylmethy...)
Affinity DataKi: >2.60E+4nM. Assay description: Inhibition of plasmin
In DepthDetails ArticlePubMed
TargetNeutrophil elastase(Homo sapiens (Human))
Johnson & Johnson Pharmaceutical Research And Development
Curated by ChEMBL
LigandPNGBDBM50312651(1-{N-[2-(Amidinoaminooxy)ethyl]amino}carbonylmethy...)
Affinity DataKi: >2.60E+4nM. Assay description: Inhibition of human leukocyte elastase
In DepthDetails ArticlePubMed
TargetUrokinase-type plasminogen activator(Homo sapiens (Human))
Johnson & Johnson Pharmaceutical Research And Development
Curated by ChEMBL
LigandPNGBDBM50312651(1-{N-[2-(Amidinoaminooxy)ethyl]amino}carbonylmethy...)
Affinity DataKi: >2.60E+4nM. Assay description: Inhibition of urokinase
In DepthDetails ArticlePubMed
TargetCoagulation factor VII(Homo sapiens (Human))
Johnson & Johnson Pharmaceutical Research And Development
Curated by ChEMBL
LigandPNGBDBM50312651(1-{N-[2-(Amidinoaminooxy)ethyl]amino}carbonylmethy...)
Affinity DataKi: >2.60E+4nM. Assay description: Inhibition of factor 7a
In DepthDetails ArticlePubMed
TargetCathepsin G(Homo sapiens (Human))
Johnson & Johnson Pharmaceutical Research And Development
Curated by ChEMBL
LigandPNGBDBM50312651(1-{N-[2-(Amidinoaminooxy)ethyl]amino}carbonylmethy...)
Affinity DataKi: >2.60E+4nM. Assay description: Inhibition of cathepsin G
In DepthDetails ArticlePubMed