BDBM50312662 1-{N-[2-(Amidinoaminooxy)ethyl]amino}carbonylmethyl-6-methyl-3-[2-(1-naphthalene)ethyl]aminopyrazinone::CHEMBL1087037
SMILES [#6]-c1cnc(-[#7]-[#6]-[#6]-c2cccc3ccccc23)c(=O)n1-[#6]-[#6](=O)-[#7]-[#6]-[#6]-[#8]\[#7]=[#6](\[#7])-[#7]
InChI Key InChIKey=PALUIMPWPYLQAY-UHFFFAOYSA-N
Data  1 KI
  Tab Delimited (TSV)   2D SDfile   Computed 3D by Vconf -m prep SDfile
Find this compound or compounds like it in BindingDB:
Activity Spreadsheet -- Enzyme Inhibition Constant Data from BindingDB
Found 1 hit for monomerid = 50312662
TargetProthrombin(Homo sapiens (Human))
Johnson & Johnson Pharmaceutical Research And Development
Curated by ChEMBL
LigandPNGBDBM50312662(1-{N-[2-(Amidinoaminooxy)ethyl]amino}carbonylmethy...)
Affinity DataKi:  12nM. Assay description: Inhibition of human alpha-thrombin
In DepthDetails ArticlePubMed