BDBM50312886 4-(5-(3-methoxyphenyl)oxazol-2-ylamino)phenol::CHEMBL1082174
SMILES COc1cccc(c1)-c1cnc(Nc2ccc(O)cc2)o1
InChI Key InChIKey=LWKIHDYMGCRQIJ-UHFFFAOYSA-N
Data  1 IC50
  Tab Delimited (TSV)   2D SDfile   Computed 3D by Vconf -m prep SDfile
Find this compound or compounds like it in BindingDB:
Activity Spreadsheet -- Enzyme Inhibition Constant Data from BindingDB
Found 1 hit for monomerid = 50312886
TargetTransitional endoplasmic reticulum ATPase(Homo sapiens (Human))
Kyowa Hakko Kogyo
Curated by ChEMBL
LigandPNGBDBM50312886(4-(5-(3-methoxyphenyl)oxazol-2-ylamino)phenol | CH...)
Affinity DataIC50:  170nM. Assay description: Inhibition of VCP assessed as conversion of ATP to ADP by enzyme coupled glucokinase assay
In DepthDetails ArticlePubMed