BDBM50312890 3alpha,8-dimethyl-1-phenethyl-1,2,3,3alpha,8,8alpha-hexahydropyrrolo[2,3-b]indol-5-yl3,4-dimethoxyphenylcarbamate::CHEMBL1081969
SMILES COc1ccc(NC(=O)Oc2ccc3N(C)[C@H]4N(CCc5ccccc5)CC[C@@]4(C)c3c2)cc1OC
InChI Key InChIKey=CPWQDMQOBNLJKC-YTMVLYRLSA-N
Data  2 IC50
  Tab Delimited (TSV)   2D SDfile   Computed 3D by Vconf -m prep SDfile
Find this compound or compounds like it in BindingDB:
Activity Spreadsheet -- Enzyme Inhibition Constant Data from BindingDB
Found 2 hits for monomerid = 50312890
TargetAcetylcholinesterase(Mus musculus (mouse))
Kyoto University
Curated by ChEMBL
LigandPNGBDBM50312890(3alpha,8-dimethyl-1-phenethyl-1,2,3,3alpha,8,8alph...)
Affinity DataIC50:  1.10E+4nM. Assay description: Inhibition of mouse brain AChE after 1 hr by modified Ellman's colorimetric method
In DepthDetails ArticlePubMed
TargetCholinesterase(Mus musculus (Mouse))
Kyoto University
Curated by ChEMBL
LigandPNGBDBM50312890(3alpha,8-dimethyl-1-phenethyl-1,2,3,3alpha,8,8alph...)
Affinity DataIC50:  97nM. Assay description: Inhibition of mouse serum BChE after 1 hr by modified Ellman's colorimetric method
In DepthDetails ArticlePubMed