BDBM50312892 3alpha,8-dimethyl-1-phenethyl-1,2,3,3alpha,8,8alpha-hexahydropyrrolo[2,3-b]indol-5-yl hexylcarbamate::CHEMBL1080546
SMILES CCCCCCNC(=O)Oc1ccc2N(C)[C@H]3N(CCc4ccccc4)CC[C@@]3(C)c2c1
InChI Key InChIKey=OXUOKFNDWUANFG-BDYUSTAISA-N
Data  2 IC50
  Tab Delimited (TSV)   2D SDfile   Computed 3D by Vconf -m prep SDfile
Find this compound or compounds like it in BindingDB:
Activity Spreadsheet -- Enzyme Inhibition Constant Data from BindingDB
Found 2 hits for monomerid = 50312892
TargetAcetylcholinesterase(Mus musculus (mouse))
Kyoto University
Curated by ChEMBL
LigandPNGBDBM50312892(3alpha,8-dimethyl-1-phenethyl-1,2,3,3alpha,8,8alph...)
Affinity DataIC50:  970nM. Assay description: Inhibition of mouse brain AChE after 1 hr by modified Ellman's colorimetric method
In DepthDetails ArticlePubMed
TargetCholinesterase(Mus musculus (Mouse))
Kyoto University
Curated by ChEMBL
LigandPNGBDBM50312892(3alpha,8-dimethyl-1-phenethyl-1,2,3,3alpha,8,8alph...)
Affinity DataIC50:  14nM. Assay description: Inhibition of mouse serum BChE after 1 hr by modified Ellman's colorimetric method
In DepthDetails ArticlePubMed