BDBM50312950 CHEMBL1079804::N-(3'-fluoro-2-(furan-2-yl)-3,4'-bipyridin-6-yl)cyclopropanecarboxamide
SMILES Fc1cnccc1-c1ccc(NC(=O)C2CC2)nc1-c1ccco1
InChI Key InChIKey=MZFJZVHTYGETAH-UHFFFAOYSA-N
Data  3 KI
  Tab Delimited (TSV)   2D SDfile   Computed 3D by Vconf -m prep SDfile
Find this compound or compounds like it in BindingDB:
Activity Spreadsheet -- Enzyme Inhibition Constant Data from BindingDB
Found 3 hits for monomerid = 50312950
TargetAdenosine receptor A2b(Homo sapiens (Human))
RhôNe-Poulenc Rorer
Curated by ChEMBL
LigandPNGBDBM50312950(CHEMBL1079804 | N-(3'-fluoro-2-(furan-2-yl)-3,4'-b...)
Affinity DataKi:  1nM. Assay description: Displacement of [3H]DPCPX from human adenosine A2B receptor expressed in HEK293 cells after 60 mins by filtration binding assay
In DepthDetails ArticlePubMed
TargetAdenosine receptor A2a(Homo sapiens (Human))
RhôNe-Poulenc Rorer
Curated by ChEMBL
LigandPNGBDBM50312950(CHEMBL1079804 | N-(3'-fluoro-2-(furan-2-yl)-3,4'-b...)
Affinity DataKi:  150nM. Assay description: Displacement of [3H]ZM241385 from human adenosine A2A receptor expressed in human HeLa cells after 1 hr by scintillation proximity assay
In DepthDetails ArticlePubMed
TargetAdenosine receptor A1(Homo sapiens (Human))
RhôNe-Poulenc Rorer
Curated by ChEMBL
LigandPNGBDBM50312950(CHEMBL1079804 | N-(3'-fluoro-2-(furan-2-yl)-3,4'-b...)
Affinity DataKi:  374nM. Assay description: Displacement of [3H]DPCPX from human adenosine A1 receptor expressed in CHO cells after 90 mins by filtration binding assay
In DepthDetails ArticlePubMed