BDBM50312956 CHEMBL1080677::N-(2-(oxazol-4-yl)-3,4'-bipyridin-6-yl)cyclopropanecarboxamide
SMILES O=C(Nc1ccc(-c2ccncc2)c(n1)-c1cocn1)C1CC1
InChI Key InChIKey=HNWYHFGFPGBRAQ-UHFFFAOYSA-N
Data  2 KI
  Tab Delimited (TSV)   2D SDfile   Computed 3D by Vconf -m prep SDfile
Find this compound or compounds like it in BindingDB:
Activity Spreadsheet -- Enzyme Inhibition Constant Data from BindingDB
Found 2 hits for monomerid = 50312956
TargetAdenosine receptor A2b(Homo sapiens (Human))
RhôNe-Poulenc Rorer
Curated by ChEMBL
LigandPNGBDBM50312956(CHEMBL1080677 | N-(2-(oxazol-4-yl)-3,4'-bipyridin-...)
Affinity DataKi:  134nM. Assay description: Displacement of [3H]DPCPX from human adenosine A2B receptor expressed in HEK293 cells after 60 mins by filtration binding assay
In DepthDetails ArticlePubMed
TargetAdenosine receptor A2a(Homo sapiens (Human))
RhôNe-Poulenc Rorer
Curated by ChEMBL
LigandPNGBDBM50312956(CHEMBL1080677 | N-(2-(oxazol-4-yl)-3,4'-bipyridin-...)
Affinity DataKi:  1.37E+3nM. Assay description: Displacement of [3H]ZM241385 from human adenosine A2A receptor expressed in human HeLa cells after 1 hr by scintillation proximity assay
In DepthDetails ArticlePubMed