BDBM50312957 CHEMBL1080679::N-(2-(1H-pyrazol-1-yl)-3,4'-bipyridin-6-yl)cyclopropanecarboxamide
SMILES O=C(Nc1ccc(-c2ccncc2)c(n1)-n1cccn1)C1CC1
InChI Key InChIKey=VMGPVLWIPVWYKM-UHFFFAOYSA-N
Data  2 KI
  Tab Delimited (TSV)   2D SDfile   Computed 3D by Vconf -m prep SDfile
Find this compound or compounds like it in BindingDB:
Activity Spreadsheet -- Enzyme Inhibition Constant Data from BindingDB
Found 2 hits for monomerid = 50312957
TargetAdenosine receptor A2b(Homo sapiens (Human))
RhôNe-Poulenc Rorer
Curated by ChEMBL
LigandPNGBDBM50312957(CHEMBL1080679 | N-(2-(1H-pyrazol-1-yl)-3,4'-bipyri...)
Affinity DataKi:  72nM. Assay description: Displacement of [3H]DPCPX from human adenosine A2B receptor expressed in HEK293 cells after 60 mins by filtration binding assay
In DepthDetails ArticlePubMed
TargetAdenosine receptor A2a(Homo sapiens (Human))
RhôNe-Poulenc Rorer
Curated by ChEMBL
LigandPNGBDBM50312957(CHEMBL1080679 | N-(2-(1H-pyrazol-1-yl)-3,4'-bipyri...)
Affinity DataKi:  1.44E+3nM. Assay description: Displacement of [3H]ZM241385 from human adenosine A2A receptor expressed in human HeLa cells after 1 hr by scintillation proximity assay
In DepthDetails ArticlePubMed