BDBM50312969 CHEMBL1080678::N-(2-(1H-pyrazol-3-yl)-3,4'-bipyridin-6-yl)cyclopropanecarboxamide
SMILES O=C(Nc1ccc(-c2ccncc2)c(n1)-c1cc[nH]n1)C1CC1
InChI Key InChIKey=OZILKDFUSAMEAC-UHFFFAOYSA-N
Data  1 KI
  Tab Delimited (TSV)   2D SDfile   Computed 3D by Vconf -m prep SDfile
Find this compound or compounds like it in BindingDB:
Activity Spreadsheet -- Enzyme Inhibition Constant Data from BindingDB
Found 1 hit for monomerid = 50312969
TargetAdenosine receptor A2b(Homo sapiens (Human))
RhôNe-Poulenc Rorer
Curated by ChEMBL
LigandPNGBDBM50312969(CHEMBL1080678 | N-(2-(1H-pyrazol-3-yl)-3,4'-bipyri...)
Affinity DataKi:  202nM. Assay description: Displacement of [3H]DPCPX from human adenosine A2B receptor expressed in HEK293 cells after 60 mins by filtration binding assay
In DepthDetails ArticlePubMed