BDBM50312970 CHEMBL1081039::Cyclopropanecarboxylic acid [2,2',3',4'']terpyridin-6'-ylamide
SMILES O=C(Nc1ccc(-c2ccncc2)c(n1)-c1ccccn1)C1CC1
InChI Key InChIKey=OHTMLKHQLZWGCY-UHFFFAOYSA-N
Data  3 KI
  Tab Delimited (TSV)   2D SDfile   Computed 3D by Vconf -m prep SDfile
Find this compound or compounds like it in BindingDB:
Activity Spreadsheet -- Enzyme Inhibition Constant Data from BindingDB
Found 3 hits for monomerid = 50312970
TargetAdenosine receptor A2b(Homo sapiens (Human))
RhôNe-Poulenc Rorer
Curated by ChEMBL
LigandPNGBDBM50312970(CHEMBL1081039 | Cyclopropanecarboxylic acid [2,2',...)
Affinity DataKi:  47nM. Assay description: Displacement of [3H]DPCPX from human adenosine A2B receptor expressed in HEK293 cells after 60 mins by filtration binding assay
In DepthDetails ArticlePubMed
TargetAdenosine receptor A2a(Homo sapiens (Human))
RhôNe-Poulenc Rorer
Curated by ChEMBL
LigandPNGBDBM50312970(CHEMBL1081039 | Cyclopropanecarboxylic acid [2,2',...)
Affinity DataKi:  862nM. Assay description: Displacement of [3H]ZM241385 from human adenosine A2A receptor expressed in human HeLa cells after 1 hr by scintillation proximity assay
In DepthDetails ArticlePubMed
TargetAdenosine receptor A1(Homo sapiens (Human))
RhôNe-Poulenc Rorer
Curated by ChEMBL
LigandPNGBDBM50312970(CHEMBL1081039 | Cyclopropanecarboxylic acid [2,2',...)
Affinity DataKi:  940nM. Assay description: Displacement of [3H]DPCPX from human adenosine A1 receptor expressed in CHO cells after 90 mins by filtration binding assay
In DepthDetails ArticlePubMed