BDBM50315257 6-Amino-9-benzyl-2-butoxy-9H-purin-8-ol::6-amino-9-benzyl-2-butoxy-7H-purin-8(9H)-one::9-benzyl-2-butoxy-8-oxoadenine::CHEMBL150961
SMILES CCCCOc1nc(N)c2[nH]c(=O)n(Cc3ccccc3)c2n1
InChI Key InChIKey=HEKGNUXGYUZNHH-UHFFFAOYSA-N
Data  1 EC50
PDB links: 1 PDB ID matches this monomer.
  Tab Delimited (TSV)   2D SDfile   Computed 3D by Vconf -m prep SDfile
Find this compound or compounds like it in BindingDB:
Activity Spreadsheet -- Enzyme Inhibition Constant Data from BindingDB
Found 1 hit for monomerid = 50315257
TargetToll-like receptor 7(Homo sapiens (Human))
Dainippon Sumitomo Pharma
Curated by ChEMBL
LigandPNGBDBM50315257(6-Amino-9-benzyl-2-butoxy-9H-purin-8-ol | 6-amino-...)
Affinity DataEC50:  63.7nM. Assay description: Agonist activity at human TLR7 expressed in HEK293 cells coexpressing pNiFty2-SEAP reporter by reporter gene assay