BDBM50315264 CHEMBL1089548::Methyl 3-{3-[(6-amino-2-butoxy-8-oxo-7,8-dihydro-9H-purin-9-yl)methyl]phenyl}propanoate
SMILES CCCCOc1nc(N)c2[nH]c(=O)n(Cc3cccc(CCC(=O)OC)c3)c2n1
InChI Key InChIKey=FFSXNXNGTLPUQE-UHFFFAOYSA-N
Data  1 EC50
  Tab Delimited (TSV)   2D SDfile   Computed 3D by Vconf -m prep SDfile
Find this compound or compounds like it in BindingDB:
Activity Spreadsheet -- Enzyme Inhibition Constant Data from BindingDB
Found 1 hit for monomerid = 50315264
TargetToll-like receptor 7(Homo sapiens (Human))
Dainippon Sumitomo Pharma
Curated by ChEMBL
LigandPNGBDBM50315264(CHEMBL1089548 | Methyl 3-{3-[(6-amino-2-butoxy-8-o...)
Affinity DataEC50:  87.5nM. Assay description: Agonist activity at human TLR7 expressed in HEK293 cells coexpressing pNiFty2-SEAP reporter by reporter gene assay
In DepthDetails ArticlePubMed