BDBM50315548 8-(2-Thioxo-7(3-m-iodophenyl)-2-(2-furyl)thiazolo[4,3-e]1,2,4-triazolo[1,5-c]pyrimidine::CHEMBL1093479
SMILES Ic1cccc(c1)-n1c2ncn3nc(nc3c2sc1=S)-c1ccco1
InChI Key InChIKey=GCWWPUIDBLGEII-UHFFFAOYSA-N
Data  2 KI
  Tab Delimited (TSV)   2D SDfile   Computed 3D by Vconf -m prep SDfile
Find this compound or compounds like it in BindingDB:
Activity Spreadsheet -- Enzyme Inhibition Constant Data from BindingDB
Found 2 hits for monomerid = 50315548
TargetAdenosine receptor A2a(Homo sapiens (Human))
University Of Delhi
Curated by ChEMBL
LigandPNGBDBM50315548(8-(2-Thioxo-7(3-m-iodophenyl)-2-(2-furyl)thiazolo[...)
Affinity DataKi:  0.00820nM. Assay description: Displacement of [3H]ZM241385 from human adenosine A2A receptor expressed in HEK293 cells after 60 mins by rapid filtration assay
In DepthDetails ArticlePubMed
TargetAdenosine receptor A1(Homo sapiens (Human))
University Of Delhi
Curated by ChEMBL
LigandPNGBDBM50315548(8-(2-Thioxo-7(3-m-iodophenyl)-2-(2-furyl)thiazolo[...)
Affinity DataKi:  2.62nM. Assay description: Displacement of [3H]DPCPX from human adenosine A1 receptor expressed in HEK293 cells after 60 mins by rapid filtration assay
In DepthDetails ArticlePubMed