BDBM50315647 CHEMBL1091938::N-[2-(4-Methoxyphenyl)-8-methylpyrazolo[4,3-e][1,2,4]triazolo-[1,5-c]pyrimidin-5-yl]phenylacetamide
SMILES COc1ccc(cc1)-c1nc2c3cn(C)nc3nc(NC(=O)Cc3ccccc3)n2n1
InChI Key InChIKey=HUOOJHJWYIJSMB-UHFFFAOYSA-N
Data  4 KI
  Tab Delimited (TSV)   2D SDfile   Computed 3D by Vconf -m prep SDfile
Find this compound or compounds like it in BindingDB:
Activity Spreadsheet -- Enzyme Inhibition Constant Data from BindingDB
Found 4 hits for monomerid = 50315647
TargetAdenosine receptor A3(Homo sapiens (Human))
National University Of Singapore
Curated by ChEMBL
LigandPNGBDBM50315647(CHEMBL1091938 | N-[2-(4-Methoxyphenyl)-8-methylpyr...)
Affinity DataKi:  0.241nM. Assay description: Displacement of [3H]NECA from human cloned adenosine A3 receptor expressed in CHO cells
In DepthDetails ArticlePubMed
TargetAdenosine receptor A2b(Homo sapiens (Human))
National University Of Singapore
Curated by ChEMBL
LigandPNGBDBM50315647(CHEMBL1091938 | N-[2-(4-Methoxyphenyl)-8-methylpyr...)
Affinity DataKi: >1.00E+4nM. Assay description: Antagonist activity at human cloned adenosine A2b receptor expressed in CHO cells assessed as inhibition of NECA-stimulated cAMP accumulation
In DepthDetails ArticlePubMed
TargetAdenosine receptor A1(Homo sapiens (Human))
National University Of Singapore
Curated by ChEMBL
LigandPNGBDBM50315647(CHEMBL1091938 | N-[2-(4-Methoxyphenyl)-8-methylpyr...)
Affinity DataKi: >3.00E+4nM. Assay description: Displacement of [3H]CCPA from human cloned adenosine A1 receptor expressed in CHO cells
In DepthDetails ArticlePubMed
TargetAdenosine receptor A2a(Homo sapiens (Human))
National University Of Singapore
Curated by ChEMBL
LigandPNGBDBM50315647(CHEMBL1091938 | N-[2-(4-Methoxyphenyl)-8-methylpyr...)
Affinity DataKi: >1.00E+5nM. Assay description: Displacement of [3H]NECA from human cloned adenosine A2a receptor expressed in CHO cells
In DepthDetails ArticlePubMed