BDBM50316155 CHEMBL357217::ES-936
SMILES COC1=CC(=O)c2c(c(COc3ccc(cc3)[N+]([O-])=O)c(C)n2C)C1=O
InChI Key InChIKey=IBLWSLZYYZHSRG-UHFFFAOYSA-N
Data  1 KI
PDB links: 1 PDB ID matches this monomer.
  Tab Delimited (TSV)   2D SDfile   Computed 3D by Vconf -m prep SDfile
Find this compound or compounds like it in BindingDB:
Activity Spreadsheet -- Enzyme Inhibition Constant Data from BindingDB
Found 1 hit for monomerid = 50316155
TargetNAD(P)H dehydrogenase [quinone] 1(Homo sapiens (Human))
China Pharmaceutical University
Curated by ChEMBL
LigandPNGBDBM50316155(CHEMBL357217 | ES-936)
Affinity DataKi:  450nM. Assay description: Inhibition of recombinant human NQO1 expressed in Escherichia coli using DCPIP as substrate assessed as rate of reduction of DCPIP in presence of NAD...