BDBM50316689 7-Fluoro-8-{4-[4-(6-methoxyquinolin-8-yl)piperazin-1-yl]piperidin-1-yl}Quinoline::CHEMBL1096530
SMILES COc1cc(N2CCN(CC2)C2CCN(CC2)c2c(F)ccc3cccnc23)c2ncccc2c1
InChI Key InChIKey=QZUWVQMRRZIPEG-UHFFFAOYSA-N
Data  1 KI  1 IC50
  Tab Delimited (TSV)   2D SDfile   Computed 3D by Vconf -m prep SDfile
Find this compound or compounds like it in BindingDB:
Activity Spreadsheet -- Enzyme Inhibition Constant Data from BindingDB
Found 2 hits for monomerid = 50316689
Target5-hydroxytryptamine receptor 1A(Homo sapiens (Human))
Pfizer
Curated by ChEMBL
LigandPNGBDBM50316689(7-Fluoro-8-{4-[4-(6-methoxyquinolin-8-yl)piperazin...)
Affinity DataKi:  276nM. Assay description: Displacement of [3H]8-OH-DPAT from human 5HT1A receptor expressed in CHO cells
In DepthDetails ArticlePubMed
Target5-hydroxytryptamine receptor 1A(Homo sapiens (Human))
Pfizer
Curated by ChEMBL
LigandPNGBDBM50316689(7-Fluoro-8-{4-[4-(6-methoxyquinolin-8-yl)piperazin...)
Affinity DataIC50:  331nM. Assay description: Antagonist activity at human 5HT1A receptor expressed in CHO cells assessed as blockade of 8-OH-DPAT-induced inhibition of forskolin-stimulated incre...
In DepthDetails ArticlePubMed