BDBM50316812 (1'R,2'S,3'R,4'R)-1-[2,3-Dihydroxy-4-(hydroxymethyl)-cyclopentan-1-yl]-6-(2-chloro-6-fluorobenzylthio)purine::CHEMBL1097866
SMILES OC[C@H]1C[C@H]([C@H](O)[C@@H]1O)n1cnc2c(SCc3c(F)cccc3Cl)ncnc12
InChI Key InChIKey=XJDXMSWJTNTVMC-BBDZHYCFSA-N
Data  1 KI
  Tab Delimited (TSV)   2D SDfile   Computed 3D by Vconf -m prep SDfile
Find this compound or compounds like it in BindingDB:
Activity Spreadsheet -- Enzyme Inhibition Constant Data from BindingDB
Found 1 hit for monomerid = 50316812
TargetAdenosine kinase(Toxoplasma gondii)
University Of Georgia
Curated by ChEMBL
LigandPNGBDBM50316812((1'R,2'S,3'R,4'R)-1-[2,3-Dihydroxy-4-(hydroxymethy...)
Affinity DataKi:  3.13E+4nM. Assay description: Binding affinity to Toxoplasma gondii adenosine kinase after 20 mins by radioactivity method
In DepthDetails ArticlePubMed