BDBM50316844 CHEMBL4162417
SMILES OC(=O)CNC(=O)c1c(O)c2cc(cc3SC(Cn(c23)c1=O)c1ccc(cc1)C(F)(F)F)C#N
InChI Key InChIKey=YXLPFGQETZNTEF-UHFFFAOYSA-N
Data  1 IC50
  Tab Delimited (TSV)   2D SDfile   Computed 3D by Vconf -m prep SDfile
Find this compound or compounds like it in BindingDB:
Activity Spreadsheet -- Enzyme Inhibition Constant Data from BindingDB
Found 1 hit for monomerid = 50316844
TargetEgl nine homolog 1(Homo sapiens (Human))
Cadila Healthcare
Curated by ChEMBL
LigandPNGBDBM50316844(CHEMBL4162417)
Affinity DataIC50:  1.5nM. Assay description: Inhibition of FLAG- tagged full length HIF-PHD2 (unknown origin) expressed in baculovirus-infected Sf9 cells using biotin labelled DLDLEMLAPYIPMDDDFQ...
In DepthDetails ArticlePubMed