BDBM50316899 2-amino-8-(4-methylpiperazin-1-yl)-4-phenyl-5H-indeno[1,2-d]pyrimidin-5-one::CHEMBL1096134
SMILES CN1CCN(CC1)c1ccc2C(=O)c3c(nc(N)nc3-c3ccccc3)-c2c1
InChI Key InChIKey=OHQBUEYIMQLWTE-UHFFFAOYSA-N
Data  2 KI
  Tab Delimited (TSV)   2D SDfile   Computed 3D by Vconf -m prep SDfile
Find this compound or compounds like it in BindingDB:
Activity Spreadsheet -- Enzyme Inhibition Constant Data from BindingDB
Found 2 hits for monomerid = 50316899
TargetAdenosine receptor A2a(Homo sapiens (Human))
Johnson & Johnson Pharmaceutical Research And Development
Curated by ChEMBL
LigandPNGBDBM50316899(2-amino-8-(4-methylpiperazin-1-yl)-4-phenyl-5H-ind...)
Affinity DataKi:  2.70nM. Assay description: Antagonistic activity at adenosine A2A receptor
In DepthDetails ArticlePubMed
TargetAdenosine receptor A1(Homo sapiens (Human))
Johnson & Johnson Pharmaceutical Research And Development
Curated by ChEMBL
LigandPNGBDBM50316899(2-amino-8-(4-methylpiperazin-1-yl)-4-phenyl-5H-ind...)
Affinity DataKi:  35.6nM. Assay description: Antagonistic activity at adenosine A1 receptor
In DepthDetails ArticlePubMed