BDBM50316959 CHEMBL1087067::N'-cyano-N-(3-(4-(4-methoxyphenyl)piperazin-1-yl)propyl)isonicotinamidine
SMILES COc1ccc(cc1)N1CCN(CCCN=C(NC#N)c2ccncc2)CC1
InChI Key InChIKey=JTDDVTJRVWDJGR-UHFFFAOYSA-N
Data  2 KI
  Tab Delimited (TSV)   2D SDfile   Computed 3D by Vconf -m prep SDfile
Find this compound or compounds like it in BindingDB:
Activity Spreadsheet -- Enzyme Inhibition Constant Data from BindingDB
Found 2 hits for monomerid = 50316959
Target5-hydroxytryptamine receptor 1A(Rattus norvegicus (rat))
Universit£
Curated by ChEMBL
LigandPNGBDBM50316959(CHEMBL1087067 | N'-cyano-N-(3-(4-(4-methoxyphenyl)...)
Affinity DataKi: >1.00E+4nM. Assay description: Displacement of [3H]-8-OH-DPAT from 5-HT1A receptor in Sprague-Dawley rat brain cortex after 30 mins liquid scintillation spectrometer
In DepthDetails ArticlePubMed
Target5-hydroxytryptamine receptor 2A(Rattus norvegicus (rat))
Universit£
Curated by ChEMBL
LigandPNGBDBM50316959(CHEMBL1087067 | N'-cyano-N-(3-(4-(4-methoxyphenyl)...)
Affinity DataKi: >1.00E+4nM. Assay description: Displacement of [3H]ketanserin hydrochloride from 5-HT2A receptor in Sprague-Dawley rat brain cortex after 15 mins
In DepthDetails ArticlePubMed