BDBM50316992 2-amino-4-phenyl-9-(pyrrolidin-1-ylmethyl)-5H-indeno[1,2-d]pyrimidin-5-one::CHEMBL1087709
SMILES Nc1nc2-c3c(cccc3CN3CCCC3)C(=O)c2c(n1)-c1ccccc1
InChI Key InChIKey=VNKVESZANYVNNB-UHFFFAOYSA-N
Data  2 KI
  Tab Delimited (TSV)   2D SDfile   Computed 3D by Vconf -m prep SDfile
Find this compound or compounds like it in BindingDB:
Activity Spreadsheet -- Enzyme Inhibition Constant Data from BindingDB
Found 2 hits for monomerid = 50316992
TargetAdenosine receptor A2a(Homo sapiens (Human))
Johnson & Johnson Pharmaceutical Research And Development
Curated by ChEMBL
LigandPNGBDBM50316992(2-amino-4-phenyl-9-(pyrrolidin-1-ylmethyl)-5H-inde...)
Affinity DataKi:  2.5nM. Assay description: Antagonist activity at adenosine A2A receptor
In DepthDetails ArticlePubMed
TargetAdenosine receptor A1(Homo sapiens (Human))
Johnson & Johnson Pharmaceutical Research And Development
Curated by ChEMBL
LigandPNGBDBM50316992(2-amino-4-phenyl-9-(pyrrolidin-1-ylmethyl)-5H-inde...)
Affinity DataKi:  116nM. Assay description: Antagonist activity at adenosine A1 receptor
In DepthDetails ArticlePubMed