BDBM50317017 2-amino-9-((diethylamino)methyl)-4-phenyl-5H-indeno[1,2-d]pyrimidin-5-one::CHEMBL1087700
SMILES CCN(CC)Cc1cccc2C(=O)c3c(nc(N)nc3-c3ccccc3)-c12
InChI Key InChIKey=XBTQUCJTNMIJCS-UHFFFAOYSA-N
Data  2 KI
  Tab Delimited (TSV)   2D SDfile   Computed 3D by Vconf -m prep SDfile
Find this compound or compounds like it in BindingDB:
Activity Spreadsheet -- Enzyme Inhibition Constant Data from BindingDB
Found 2 hits for monomerid = 50317017
TargetAdenosine receptor A2a(Homo sapiens (Human))
Johnson & Johnson Pharmaceutical Research And Development
Curated by ChEMBL
LigandPNGBDBM50317017(2-amino-9-((diethylamino)methyl)-4-phenyl-5H-inden...)
Affinity DataKi:  18.3nM. Assay description: Antagonist activity at adenosine A2A receptor
In DepthDetails ArticlePubMed
TargetAdenosine receptor A1(Homo sapiens (Human))
Johnson & Johnson Pharmaceutical Research And Development
Curated by ChEMBL
LigandPNGBDBM50317017(2-amino-9-((diethylamino)methyl)-4-phenyl-5H-inden...)
Affinity DataKi:  107nM. Assay description: Antagonist activity at adenosine A1 receptor
In DepthDetails ArticlePubMed