BDBM50317018 2-amino-4-phenyl-9-(piperidin-1-ylmethyl)-5H-indeno[1,2-d]pyrimidin-5-one::CHEMBL1087701
SMILES Nc1nc2-c3c(cccc3CN3CCCCC3)C(=O)c2c(n1)-c1ccccc1
InChI Key InChIKey=QPEPHZDDNBFIFT-UHFFFAOYSA-N
Data  2 KI
  Tab Delimited (TSV)   2D SDfile   Computed 3D by Vconf -m prep SDfile
Find this compound or compounds like it in BindingDB:
Activity Spreadsheet -- Enzyme Inhibition Constant Data from BindingDB
Found 2 hits for monomerid = 50317018
TargetAdenosine receptor A2a(Homo sapiens (Human))
Johnson & Johnson Pharmaceutical Research And Development
Curated by ChEMBL
LigandPNGBDBM50317018(2-amino-4-phenyl-9-(piperidin-1-ylmethyl)-5H-inden...)
Affinity DataKi:  14.3nM. Assay description: Antagonist activity at adenosine A2A receptor
In DepthDetails ArticlePubMed
TargetAdenosine receptor A1(Homo sapiens (Human))
Johnson & Johnson Pharmaceutical Research And Development
Curated by ChEMBL
LigandPNGBDBM50317018(2-amino-4-phenyl-9-(piperidin-1-ylmethyl)-5H-inden...)
Affinity DataKi:  40.8nM. Assay description: Antagonist activity at adenosine A1 receptor
In DepthDetails ArticlePubMed