BDBM50317026 CHEMBL1097320::N1-((1S,2S)-3-(3,5-difluorophenyl)-1-hydroxy-1-((R)-4-(o-tolylsulfonyl)piperazin-2-yl)propan-2-yl)-5-methyl-N3,N3-dipropylisophthalamide
SMILES CCCN(CCC)C(=O)c1cc(C)cc(c1)C(=O)N[C@@H](Cc1cc(F)cc(F)c1)[C@H](O)[C@H]1CN(CCN1)S(=O)(=O)c1ccccc1C
InChI Key InChIKey=ZDGZBDSYGPHAJS-PZWMIYICSA-N
Data  1 KI  1 IC50
  Tab Delimited (TSV)   2D SDfile   Computed 3D by Vconf -m prep SDfile
Find this compound or compounds like it in BindingDB:
Activity Spreadsheet -- Enzyme Inhibition Constant Data from BindingDB
Found 2 hits for monomerid = 50317026
TargetBeta-secretase 1(Homo sapiens (Human))
Merck Research Laboratories
Curated by ChEMBL
LigandPNGBDBM50317026(CHEMBL1097320 | N1-((1S,2S)-3-(3,5-difluorophenyl)...)
Affinity DataKi:  5nM. Assay description: Inhibition oh BACE1
In DepthDetails ArticlePubMed
TargetBeta-secretase 1(Homo sapiens (Human))
Merck Research Laboratories
Curated by ChEMBL
LigandPNGBDBM50317026(CHEMBL1097320 | N1-((1S,2S)-3-(3,5-difluorophenyl)...)
Affinity DataIC50:  64nM. Assay description: Inhibition of BACE1 expressed in HEK293 cells expressing human APP assessed as amyloid beta42 production
In DepthDetails ArticlePubMed